BDBM50199992 (1R,4S)-4-amino-3-trifluoromethyl-cyclopent-2-ene carboxylic acid::CHEMBL216971
SMILES N[C@H]1C[C@H](C=C1C(F)(F)F)C(O)=O
InChI Key InChIKey=RFKHKEGYMCUFJJ-UCORVYFPSA-N
Data  1 KI
  Tab Delimited (TSV)   2D SDfile   Computed 3D by Vconf -m prep SDfile
Find this compound or compounds like it in BindingDB:
Activity Spreadsheet -- Enzyme Inhibition Constant Data from BindingDB
Found 1 hit for monomerid = 50199992
Target4-aminobutyrate aminotransferase, mitochondrial(Sus scrofa)
Northwestern University
Curated by ChEMBL
LigandPNGBDBM50199992((1R,4S)-4-amino-3-trifluoromethyl-cyclopent-2-ene ...)
Affinity DataKi:  4.11E+6nM. Assay description: Inhibition of pig brain GABA-AT in presence of beta-mercaptoethanol
In DepthDetails ArticlePubMed