BDBM50200135 CHEMBL3961496
SMILES O=C(Nc1cccc(CNC(=O)c2cc3ccccc3s2)c1)\C=C\c1ccccc1
InChI Key InChIKey=YOOFKMLSRHWAQH-BUHFOSPRSA-N
Data  1 IC50
  Tab Delimited (TSV)   2D SDfile   Computed 3D by Vconf -m prep SDfile
Find this compound or compounds like it in BindingDB:
Activity Spreadsheet -- Enzyme Inhibition Constant Data from BindingDB
Found 1 hit for monomerid = 50200135
TargetSentrin-specific protease 1(Homo sapiens (Human))
Shanghai Jiao Tong University
Curated by ChEMBL
LigandPNGBDBM50200135(CHEMBL3961496)
Affinity DataIC50:  7.10E+3nM. Assay description: Inhibition of SENP1 catalytic domain (419 to 644 residues) (unknown origin) expressed in Escherichia coli BL21 (DE3) assessed as reduction in deSUMOy...
In DepthDetails ArticlePubMed