BDBM50200226 CHEMBL226355::N-(2,4-dichlorophenyl)-4-(4-(2-methoxyphenyl)piperazin-1-yl)butanamide
SMILES COc1ccccc1N1CCN(CCCC(=O)Nc2ccc(Cl)cc2Cl)CC1
InChI Key InChIKey=ZCTIKWDKXFRMTQ-UHFFFAOYSA-N
Data  1 IC50
  Tab Delimited (TSV)   2D SDfile   Computed 3D by Vconf -m prep SDfile
Find this compound or compounds like it in BindingDB:
Activity Spreadsheet -- Enzyme Inhibition Constant Data from BindingDB
Found 1 hit for monomerid = 50200226
TargetVoltage-dependent T-type calcium channel subunit alpha-1G(Homo sapiens (Human))
Institute Of Science And Technology
Curated by ChEMBL
LigandPNGBDBM50200226(CHEMBL226355 | N-(2,4-dichlorophenyl)-4-(4-(2-meth...)
Affinity DataIC50:  3.34E+3nM. Assay description: Inhibition of T type calcium channel subunit alpha1G expressed in HEK293 cells assessed as effect on T-type calcium currents by patch clamp method
In DepthDetails ArticlePubMed