BDBM50200451 4-sulfamoyl-benzoic acid 1-((2S,3S,4R,5R)-3,4,5-trihydroxy-tetrahydro-pyran-2-yl)-1H-[1,2,3]triazol-4-ylmethyl ester::CHEMBL392485
SMILES NS(=O)(=O)c1ccc(cc1)C(=O)OCc1cn(nn1)[C@H]1OC[C@@H](O)[C@@H](O)[C@@H]1O
InChI Key InChIKey=OZAWJTGBWLTNPL-MQYQWHSLSA-N
Data  2 KI
  Tab Delimited (TSV)   2D SDfile   Computed 3D by Vconf -m prep SDfile
Find this compound or compounds like it in BindingDB:
Activity Spreadsheet -- Enzyme Inhibition Constant Data from BindingDB
Found 2 hits for monomerid = 50200451
TargetCarbonic anhydrase 12(Homo sapiens (Human))
Griffith University
Curated by ChEMBL
LigandPNGBDBM50200451(4-sulfamoyl-benzoic acid 1-((2S,3S,4R,5R)-3,4,5-tr...)
Affinity DataKi:  1.10nM. Assay description: Inhibition of human recombinant CA12 by CO2 hydration assay
In DepthDetails ArticlePubMed
TargetCarbonic anhydrase 14(Homo sapiens (Human))
Griffith University
Curated by ChEMBL
LigandPNGBDBM50200451(4-sulfamoyl-benzoic acid 1-((2S,3S,4R,5R)-3,4,5-tr...)
Affinity DataKi:  10.9nM. Assay description: Inhibition of human recombinant CA14 by CO2 hydration assay
In DepthDetails ArticlePubMed