BDBM50200688 CHEMBL3929553
SMILES COc1cc(CN(CCN)C(C)c2ccc3OCCc3c2)ccc1OCCN1C(=O)CCC1=O
InChI Key InChIKey=FFEKTSZFAILVCR-UHFFFAOYSA-N
Data  1 IC50
  Tab Delimited (TSV)   2D SDfile   Computed 3D by Vconf -m prep SDfile
Find this compound or compounds like it in BindingDB:
Activity Spreadsheet -- Enzyme Inhibition Constant Data from BindingDB
Found 1 hit for monomerid = 50200688
TargetC-X-C chemokine receptor type 3(Homo sapiens (Human))
Sanofi
Curated by ChEMBL
LigandPNGBDBM50200688(CHEMBL3929553)
Affinity DataIC50:  2.20E+3nM. Assay description: Displacement of [125I]-CXCL10 from human recombinant CXCR3 transfected in Flp-In-CHO cell membranes after 60 mins by gamma counting method
In DepthDetails ArticlePubMed