BDBM50200690 CHEMBL3986823
SMILES COc1cc(CN(CCCC(O)=O)C(C)c2ccc3OCCc3c2)ccc1OCCN1C(=O)CCC1=O
InChI Key InChIKey=HAVGLJPACFJXNN-UHFFFAOYSA-N
Data  1 IC50
  Tab Delimited (TSV)   2D SDfile   Computed 3D by Vconf -m prep SDfile
Find this compound or compounds like it in BindingDB:
Activity Spreadsheet -- Enzyme Inhibition Constant Data from BindingDB
Found 1 hit for monomerid = 50200690
TargetC-X-C chemokine receptor type 3(Homo sapiens (Human))
Sanofi
Curated by ChEMBL
LigandPNGBDBM50200690(CHEMBL3986823)
Affinity DataIC50:  210nM. Assay description: Displacement of [125I]-CXCL10 from human recombinant CXCR3 transfected in Flp-In-CHO cell membranes after 60 mins by gamma counting method
In DepthDetails ArticlePubMed