BDBM50200694 CHEMBL3932217
SMILES COC(=O)[C@H]1CC[C@H](CN(Cc2ccc(OCCN3C(=O)CCC3=O)c(OC)c2)[C@H]2CCc3cc(Cl)ccc23)CC1
InChI Key InChIKey=OMGBAHOOLBBDCP-MYIHVTGJSA-N
Data  1 IC50
  Tab Delimited (TSV)   2D SDfile   Computed 3D by Vconf -m prep SDfile
Find this compound or compounds like it in BindingDB:
Activity Spreadsheet -- Enzyme Inhibition Constant Data from BindingDB
Found 1 hit for monomerid = 50200694
TargetC-X-C chemokine receptor type 3(Homo sapiens (Human))
Sanofi
Curated by ChEMBL
LigandPNGBDBM50200694(CHEMBL3932217)
Affinity DataIC50:  840nM. Assay description: Displacement of [125I]-CXCL10 from human recombinant CXCR3 transfected in Flp-In-CHO cell membranes after 60 mins by gamma counting method
In DepthDetails ArticlePubMed