BDBM50200715 CHEMBL3912263
SMILES CN(Cc1ccc(OCCn2c(=O)ccn(C)c2=O)c(C)c1)C(CC(O)=O)c1ccc(Cl)cc1
InChI Key InChIKey=HOVIHHVVNWVPOF-UHFFFAOYSA-N
Data  1 IC50
  Tab Delimited (TSV)   2D SDfile   Computed 3D by Vconf -m prep SDfile
Find this compound or compounds like it in BindingDB:
Activity Spreadsheet -- Enzyme Inhibition Constant Data from BindingDB
Found 1 hit for monomerid = 50200715
TargetC-X-C chemokine receptor type 3(Homo sapiens (Human))
Sanofi
Curated by ChEMBL
LigandPNGBDBM50200715(CHEMBL3912263)
Affinity DataIC50:  1.30E+3nM. Assay description: Displacement of [125I]-CXCL10 from human recombinant CXCR3 transfected in Flp-In-CHO cell membranes after 60 mins by gamma counting method
In DepthDetails ArticlePubMed