BDBM50200761 4-(4-methoxyphenyl)-5-cyano-2H-1,2,3-triazole::CHEMBL239896
SMILES COc1ccc(cc1)-c1nn[nH]c1C#N
InChI Key InChIKey=KHRXUZBXDSNCBO-UHFFFAOYSA-N
Data  1 IC50
  Tab Delimited (TSV)   2D SDfile   Computed 3D by Vconf -m prep SDfile
Find this compound or compounds like it in BindingDB:
Activity Spreadsheet -- Enzyme Inhibition Constant Data from BindingDB
Found 1 hit for monomerid = 50200761
TargetReceptor tyrosine-protein kinase erbB-2(Homo sapiens (Human))
Sun Yat-Sen University
Curated by ChEMBL
LigandPNGBDBM50200761(4-(4-methoxyphenyl)-5-cyano-2H-1,2,3-triazole | CH...)
Affinity DataIC50: >5.00E+4nM. Assay description: Inhibition of HER2 tyrosine kinase phosphorylation in human MDA-MB-453 cells by Western blot assay
In DepthDetails ArticlePubMed