BDBM50200997 1-[7-(triphenylmethoxy)heptyl]thymine::CHEMBL219367
SMILES Cc1cn(CCCCCCCOC(c2ccccc2)(c2ccccc2)c2ccccc2)c(=O)[nH]c1=O
InChI Key InChIKey=MYFJLJCVSVNEDV-UHFFFAOYSA-N
Data  2 IC50
  Tab Delimited (TSV)   2D SDfile   Computed 3D by Vconf -m prep SDfile
Find this compound or compounds like it in BindingDB:
Activity Spreadsheet -- Enzyme Inhibition Constant Data from BindingDB
Found 2 hits for monomerid = 50200997
TargetDeoxynucleoside kinase(Drosophila melanogaster)
Instituto De QuíMica MéDica (Csic)
Curated by ChEMBL
LigandPNGBDBM50200997(1-[7-(triphenylmethoxy)heptyl]thymine | CHEMBL2193...)
Affinity DataIC50:  3.20E+4nM. Assay description: Inhibition of [3H]methyl dThd phosphorylation by Drosophila melanogaster dNK
In DepthDetails ArticlePubMed
TargetThymidine kinase 2, mitochondrial(Homo sapiens (Human))
Instituto De QuíMica MéDica (Csic)
Curated by ChEMBL
LigandPNGBDBM50200997(1-[7-(triphenylmethoxy)heptyl]thymine | CHEMBL2193...)
Affinity DataIC50:  4.70E+3nM. Assay description: Inhibition of [3H]methyl dThd phosphorylation by TK2
In DepthDetails ArticlePubMed