BDBM50201389 3-methyl-5-(pyridin-4-ylmethylamino)-N-(3-(trifluoromethoxy)phenyl)isoxazole-4-carboxamide::CHEMBL391671
SMILES Cc1noc(NCc2ccncc2)c1C(=O)Nc1cccc(OC(F)(F)F)c1
InChI Key InChIKey=HIVRIAMFVGJSGK-UHFFFAOYSA-N
Data  3 IC50
  Tab Delimited (TSV)   2D SDfile   Computed 3D by Vconf -m prep SDfile
Find this compound or compounds like it in BindingDB:
Activity Spreadsheet -- Enzyme Inhibition Constant Data from BindingDB
Found 3 hits for monomerid = 50201389
TargetVascular endothelial growth factor receptor 1(Homo sapiens (Human))
Chemical Diversity
Curated by ChEMBL
LigandPNGBDBM50201389(3-methyl-5-(pyridin-4-ylmethylamino)-N-(3-(trifluo...)
Affinity DataIC50:  5.66E+3nM. Assay description: Inhibition of VEGFR1 by HTRF assay
In DepthDetails ArticlePubMed
TargetVascular endothelial growth factor receptor 2(Homo sapiens (Human))
Chemical Diversity
Curated by ChEMBL
LigandPNGBDBM50201389(3-methyl-5-(pyridin-4-ylmethylamino)-N-(3-(trifluo...)
Affinity DataIC50: >1.00E+4nM. Assay description: Inhibition of VEGFR2 by HTRF assay
In DepthDetails ArticlePubMed
TargetVascular endothelial growth factor receptor 2(Homo sapiens (Human))
Chemical Diversity
Curated by ChEMBL
LigandPNGBDBM50201389(3-methyl-5-(pyridin-4-ylmethylamino)-N-(3-(trifluo...)
Affinity DataIC50: >1.00E+4nM. Assay description: Inhibition of VEGFR2 by cell-based assay
In DepthDetails ArticlePubMed