BDBM50201490 CHEMBL391398::N-(3-cyanophenyl)-2-oxo-2,3-dihydrobenzo[d]oxazole-4-carboxamide
SMILES O=C(Nc1cccc(c1)C#N)c1cccc2oc(=O)[nH]c12
InChI Key InChIKey=IKEXEQNMTRYLGJ-UHFFFAOYSA-N
Data  1 KI
  Tab Delimited (TSV)   2D SDfile   Computed 3D by Vconf -m prep SDfile
Find this compound or compounds like it in BindingDB:
Activity Spreadsheet -- Enzyme Inhibition Constant Data from BindingDB
Found 1 hit for monomerid = 50201490
TargetMetabotropic glutamate receptor 5(Homo sapiens (Human))
F. Hoffmann-La Roche
Curated by ChEMBL
LigandPNGBDBM50201490(CHEMBL391398 | N-(3-cyanophenyl)-2-oxo-2,3-dihydro...)
Affinity DataKi:  327nM. Assay description: Binding affinity to mGluR5
In DepthDetails ArticlePubMed