BDBM50201537 CHEMBL3910313
SMILES N#Cc1c(cc2[nH]nc(-c3ccccc3)c2c1-c1ccccc1)-c1ccccc1
InChI Key InChIKey=QJCLGXLWPYVAGP-UHFFFAOYSA-N
Data  1 EC50
  Tab Delimited (TSV)   2D SDfile   Computed 3D by Vconf -m prep SDfile
Find this compound or compounds like it in BindingDB:
Activity Spreadsheet -- Enzyme Inhibition Constant Data from BindingDB
Found 1 hit for monomerid = 50201537
TargetMetabotropic glutamate receptor 5(Homo sapiens (Human))
Bristol-Myers Squibb
Curated by ChEMBL
LigandPNGBDBM50201537(CHEMBL3910313)
Affinity DataEC50:  1.30E+3nM. Assay description: Positive allosteric modulation of mGlu5 receptor (unknown origin) assessed as increase in L-glutamate-induced calcium release after 60 mins by cell b...
In DepthDetails ArticlePubMed