BDBM50201633 CHEMBL3972378
SMILES FC(F)(F)c1ccc(cc1)C(=O)NCCCC(=O)N[C@@H]1CCCc2ccccc12
InChI Key InChIKey=DRQCKOPZFQBCIW-LJQANCHMSA-N
Data  1 IC50
  Tab Delimited (TSV)   2D SDfile   Computed 3D by Vconf -m prep SDfile
Find this compound or compounds like it in BindingDB:
Activity Spreadsheet -- Enzyme Inhibition Constant Data from BindingDB
Found 1 hit for monomerid = 50201633
TargetDihydroorotate dehydrogenase (quinone), mitochondrial(Homo sapiens (Human))
Broad Institute
Curated by ChEMBL
LigandPNGBDBM50201633(CHEMBL3972378)
Affinity DataIC50: >2.00E+4nM. Assay description: Inhibition of human recombinant DHODH
In DepthDetails ArticlePubMed