BDBM50201653 CHEMBL3962678
SMILES CN(c1cc(CO)ccc1C)c1nc(Nc2ccc(N3CCN(C)CC3)c(c2)S(C)(=O)=O)ncc1F
InChI Key InChIKey=XHLWSDNRXILCDY-UHFFFAOYSA-N
Data  2 IC50
  Tab Delimited (TSV)   2D SDfile   Computed 3D by Vconf -m prep SDfile
Find this compound or compounds like it in BindingDB:
Activity Spreadsheet -- Enzyme Inhibition Constant Data from BindingDB
Found 2 hits for monomerid = 50201653
TargetSerine/threonine-protein kinase PAK 1(Homo sapiens (Human))
Astrazeneca
Curated by ChEMBL
LigandPNGBDBM50201653(CHEMBL3962678)
Affinity DataIC50:  810nM. Assay description: Inhibition of PAK1 phosphorylation in human MCF10A cells
In DepthDetails ArticlePubMed
TargetSerine/threonine-protein kinase PAK 1(Homo sapiens (Human))
Astrazeneca
Curated by ChEMBL
LigandPNGBDBM50201653(CHEMBL3962678)
Affinity DataIC50:  8.70nM. Assay description: Inhibition of PAK1 (unknown origin) by ATP-kinaseGlo assay
In DepthDetails ArticlePubMed