BDBM50201772 2-(5,6-dichloro-1H-benzo[d]imidazol-2-yl)-1,1,1-trifluoro-3-methylbutan-2-ol::CHEMBL401458
SMILES CC(C)C(O)(c1nc2cc(Cl)c(Cl)cc2[nH]1)C(F)(F)F
InChI Key InChIKey=ZFXDDXAVZDTACE-UHFFFAOYSA-N
Data  1 IC50
  Tab Delimited (TSV)   2D SDfile   Computed 3D by Vconf -m prep SDfile
Find this compound or compounds like it in BindingDB:
Activity Spreadsheet -- Enzyme Inhibition Constant Data from BindingDB
Found 1 hit for monomerid = 50201772
TargetAndrogen receptor(Homo sapiens (Human))
Johnson & Johnson Pharmaceutical Research And Development
Curated by ChEMBL
LigandPNGBDBM50201772(2-(5,6-dichloro-1H-benzo[d]imidazol-2-yl)-1,1,1-tr...)
Affinity DataIC50:  2nM. Assay description: Binding affinity at androgen receptor expressed in COS cells by whole cell binding assay
In DepthDetails ArticlePubMed