BDBM50201791 CHEMBL3920110
SMILES COc1ccc(CCN2CCN(CC2)c2ccccc2OC(C)C)cc1OC
InChI Key InChIKey=KXRMZNJDJRDPLT-UHFFFAOYSA-N
Data  3 KI
  Tab Delimited (TSV)   2D SDfile   Computed 3D by Vconf -m prep SDfile
Find this compound or compounds like it in BindingDB:
Activity Spreadsheet -- Enzyme Inhibition Constant Data from BindingDB
Found 3 hits for monomerid = 50201791
TargetAlpha-1D adrenergic receptor(Homo sapiens (Human))
University Of Bras£Lia
Curated by ChEMBL
LigandPNGBDBM50201791(CHEMBL3920110)
Affinity DataKi:  1.30nM. Assay description: Displacement of [3H]prazosin from human alpha1D-adrenoceptor expressed in CHO cell membranes measured after 30 mins
In DepthDetails ArticlePubMed
TargetAlpha-1A adrenergic receptor(Homo sapiens (Human))
University Of Bras£Lia
Curated by ChEMBL
LigandPNGBDBM50201791(CHEMBL3920110)
Affinity DataKi:  2nM. Assay description: Displacement of [3H]prazosin from human alpha1A-adrenoceptor expressed in CHO cell membranes measured after 30 mins
In DepthDetails ArticlePubMed
TargetAlpha-1B adrenergic receptor(Homo sapiens (Human))
University Of Bras£Lia
Curated by ChEMBL
LigandPNGBDBM50201791(CHEMBL3920110)
Affinity DataKi:  10nM. Assay description: Displacement of [3H]prazosin from human alpha1B-adrenoceptor expressed in CHO cell membranes measured after 30 mins
In DepthDetails ArticlePubMed