BDBM50202302 1-ethyl-2,3,12,12a-tetrahydro-1H-7-oxa-1-aza-pleiaden-5-ol::CHEMBL439639
SMILES CCN1CCc2cc(O)cc3Oc4ccccc4CC1c23
InChI Key InChIKey=KAUFSVBKTMJNMB-UHFFFAOYSA-N
Data  4 KI
  Tab Delimited (TSV)   2D SDfile   Computed 3D by Vconf -m prep SDfile
Find this compound or compounds like it in BindingDB:
Activity Spreadsheet -- Enzyme Inhibition Constant Data from BindingDB
Found 4 hits for monomerid = 50202302
TargetD(1A) dopamine receptor(RAT)
Universit£
Curated by ChEMBL
LigandPNGBDBM50202302(1-ethyl-2,3,12,12a-tetrahydro-1H-7-oxa-1-aza-pleia...)
Affinity DataKi:  3.47E+3nM. Assay description: Binding Affinity was determined against Dopamine receptor D1 in rat striatal membranes using [3H]- SCH 23390 radioligand.
In DepthDetails ArticlePubMed
TargetD(1A) dopamine receptor(RAT)
Universit£
Curated by ChEMBL
LigandPNGBDBM50202302(1-ethyl-2,3,12,12a-tetrahydro-1H-7-oxa-1-aza-pleia...)
Affinity DataKi:  3.50E+3nM. Assay description: Displacement of [3H]SCH-23390 from rat dopamine D1 receptor
In DepthDetails ArticlePubMed
TargetD(2) dopamine receptor(Rattus norvegicus (rat))
Universit£
Curated by ChEMBL
LigandPNGBDBM50202302(1-ethyl-2,3,12,12a-tetrahydro-1H-7-oxa-1-aza-pleia...)
Affinity DataKi:  6.46E+3nM. Assay description: Binding Affinity was determined against Dopamine receptor D2 in rat striatal membranes using [3H]- spiperone radioligand.
In DepthDetails ArticlePubMed
TargetD(2) dopamine receptor(Rattus norvegicus (rat))
Universit£
Curated by ChEMBL
LigandPNGBDBM50202302(1-ethyl-2,3,12,12a-tetrahydro-1H-7-oxa-1-aza-pleia...)
Affinity DataKi:  6.50E+3nM. Assay description: Displacement of [3H]raclopride from rat dopamine D2 receptor
In DepthDetails ArticlePubMed