BDBM50202553 CHEMBL3958024
SMILES Fc1ccc(cc1)S(=O)(=O)Nc1cc(cnc1Cl)-c1ccc2nccc(-c3ccc(Cn4cncn4)cc3)c2c1
InChI Key InChIKey=MNZKMJAACZQCQH-UHFFFAOYSA-N
Data  1 IC50
  Tab Delimited (TSV)   2D SDfile   Computed 3D by Vconf -m prep SDfile
Find this compound or compounds like it in BindingDB:
Activity Spreadsheet -- Enzyme Inhibition Constant Data from BindingDB
Found 1 hit for monomerid = 50202553
TargetPhosphatidylinositol 4,5-bisphosphate 3-kinase catalytic subunit alpha isoform(Homo sapiens (Human))
Second Military Medical University
Curated by ChEMBL
LigandPNGBDBM50202553(CHEMBL3958024)
Affinity DataIC50:  0.730nM. Assay description: Inhibition of PI3Kalpha (unknown origin) using PIP2 as substrate after 1 hr in presence of ATP by kinase-glo luminescence assay
In DepthDetails ArticlePubMed