BDBM50202559 CHEMBL3985191
SMILES COc1ncc(cc1NS(=O)(=O)c1ccc(F)cc1F)-c1ccc2nccc(-c3ccc(C)cc3)c2c1
InChI Key InChIKey=MAMRHDZUBGCTFM-UHFFFAOYSA-N
Data  1 IC50
  Tab Delimited (TSV)   2D SDfile   Computed 3D by Vconf -m prep SDfile
Find this compound or compounds like it in BindingDB:
Activity Spreadsheet -- Enzyme Inhibition Constant Data from BindingDB
Found 1 hit for monomerid = 50202559
TargetPhosphatidylinositol 4,5-bisphosphate 3-kinase catalytic subunit alpha isoform(Homo sapiens (Human))
Second Military Medical University
Curated by ChEMBL
LigandPNGBDBM50202559(CHEMBL3985191)
Affinity DataIC50:  4.5nM. Assay description: Inhibition of PI3Kalpha (unknown origin) using PIP2 as substrate after 1 hr in presence of ATP by kinase-glo luminescence assay
In DepthDetails ArticlePubMed