BDBM50202560 CHEMBL3905333
SMILES CNCCN(C)Cc1ccc(cc1)-c1ccnc2ccc(cc12)-c1cnc(OC)c(NS(=O)(=O)c2ccc(F)cc2F)c1
InChI Key InChIKey=ZZZGLALTAWYHHN-UHFFFAOYSA-N
Data  1 IC50
  Tab Delimited (TSV)   2D SDfile   Computed 3D by Vconf -m prep SDfile
Find this compound or compounds like it in BindingDB:
Activity Spreadsheet -- Enzyme Inhibition Constant Data from BindingDB
Found 1 hit for monomerid = 50202560
TargetPhosphatidylinositol 4,5-bisphosphate 3-kinase catalytic subunit alpha isoform(Homo sapiens (Human))
Second Military Medical University
Curated by ChEMBL
LigandPNGBDBM50202560(CHEMBL3905333)
Affinity DataIC50:  2.5nM. Assay description: Inhibition of PI3Kalpha (unknown origin) using PIP2 as substrate after 1 hr in presence of ATP by kinase-glo luminescence assay
In DepthDetails ArticlePubMed