BDBM50202574 1-deoxy-1-{6-[N'-(5-bromo-furan-2-carbonyl)-hydrazino]-9H-purin-9-yl}-N-ethyl-beta-D-ribofuranuronamide::5-bromo-N'-(9-((2R,3R,4S,5S)-5-(ethylcarbamoyl)-3,4-dihydroxy-tetrahydrofuran-2-yl)-9H-purin-6-yl)furan-2-carbohydrazide::CHEMBL219361
SMILES CCNC(=O)[C@H]1O[C@H]([C@H](O)[C@@H]1O)n1cnc2c(NNC(=O)c3ccc(Br)o3)ncnc12
InChI Key InChIKey=PHIWKNTWYPRCIC-HBGPKNEHSA-N
Data  3 KI  2 EC50
  Tab Delimited (TSV)   2D SDfile   Computed 3D by Vconf -m prep SDfile
Find this compound or compounds like it in BindingDB:
Activity Spreadsheet -- Enzyme Inhibition Constant Data from BindingDB
Found 5 hits for monomerid = 50202574
TargetAdenosine receptor A1(Homo sapiens (Human))
Universit£
Curated by ChEMBL
LigandPNGBDBM50202574(1-deoxy-1-{6-[N'-(5-bromo-furan-2-carbonyl)-hydraz...)
Affinity DataKi:  780nM. Assay description: Displacement of [3H]CHA from human adenosine A1 receptor expressed in CHO cells
In DepthDetails ArticlePubMed
TargetAdenosine receptor A2a(Homo sapiens (Human))
Universit£
Curated by ChEMBL
LigandPNGBDBM50202574(1-deoxy-1-{6-[N'-(5-bromo-furan-2-carbonyl)-hydraz...)
Affinity DataKi:  1.20E+3nM. Assay description: Displacement of [3H]CGS-21680 from human adenosine A2A receptor expressed in CHO cells
In DepthDetails ArticlePubMed
TargetAdenosine receptor A3(Homo sapiens (Human))
Universit£
Curated by ChEMBL
LigandPNGBDBM50202574(1-deoxy-1-{6-[N'-(5-bromo-furan-2-carbonyl)-hydraz...)
Affinity DataKi: >5.00E+3nM. Assay description: Displacement of [125I]AB-MECA from human adenosine A3 receptor expressed in CHO cells
In DepthDetails ArticlePubMed
TargetAdenosine receptor A2b(Homo sapiens (Human))
National Institute Of Diabetes And Digestive And Kidney Diseases
Curated by ChEMBL
LigandPNGBDBM50202574(1-deoxy-1-{6-[N'-(5-bromo-furan-2-carbonyl)-hydraz...)
Affinity DataEC50:  2.71E+6nM. Assay description: Agonist activity at human adenosine A2B receptor expressed in CHO cells assessed as stimulation of adenylate cyclase
In DepthDetails ArticlePubMed
TargetAdenosine receptor A2b(Homo sapiens (Human))
National Institute Of Diabetes And Digestive And Kidney Diseases
Curated by ChEMBL
LigandPNGBDBM50202574(1-deoxy-1-{6-[N'-(5-bromo-furan-2-carbonyl)-hydraz...)
Affinity DataEC50:  369nM. Assay description: Activity at human adenosine A2B receptor expressed in CHO cells assessed as stimulation of cAMP levels
In DepthDetails ArticlePubMed