BDBM50202631 CHEMBL3911998
SMILES COc1ncc(cc1NS(=O)(=O)c1ccc(F)cc1)-c1ccc2nccc(-c3ccc(CN(C)CCO)cc3)c2c1
InChI Key InChIKey=FSMNNDQUPANPBB-UHFFFAOYSA-N
Data  1 IC50
  Tab Delimited (TSV)   2D SDfile   Computed 3D by Vconf -m prep SDfile
Find this compound or compounds like it in BindingDB:
Activity Spreadsheet -- Enzyme Inhibition Constant Data from BindingDB
Found 1 hit for monomerid = 50202631
TargetPhosphatidylinositol 4,5-bisphosphate 3-kinase catalytic subunit alpha isoform(Homo sapiens (Human))
Second Military Medical University
Curated by ChEMBL
LigandPNGBDBM50202631(CHEMBL3911998)
Affinity DataIC50:  4.80nM. Assay description: Inhibition of PI3Kalpha (unknown origin) using PIP2 as substrate after 1 hr in presence of ATP by kinase-glo luminescence assay
In DepthDetails ArticlePubMed