BDBM50202690 2-(4-(2-(4-isopropoxyphenoxy)thiazol-5-yl)but-3-yn-2-ylamino)-2-oxoacetic acid::CHEMBL392881
SMILES CC(C)Oc1ccc(Oc2ncc(s2)C#CC(C)NC(=O)C(O)=O)cc1
InChI Key InChIKey=AXJRYBILESCDSJ-UHFFFAOYSA-N
Data  2 IC50
  Tab Delimited (TSV)   2D SDfile   Computed 3D by Vconf -m prep SDfile
Find this compound or compounds like it in BindingDB:
Activity Spreadsheet -- Enzyme Inhibition Constant Data from BindingDB
Found 2 hits for monomerid = 50202690
TargetAcetyl-CoA carboxylase 1(Homo sapiens (Human))
Abbott Laboratories
Curated by ChEMBL
LigandPNGBDBM50202690(2-(4-(2-(4-isopropoxyphenoxy)thiazol-5-yl)but-3-yn...)
Affinity DataIC50: >3.00E+4nM. Assay description: Inhibition of ACC1
In DepthDetails ArticlePubMed
TargetAcetyl-CoA carboxylase 2(Homo sapiens (Human))
Abbott Laboratories
Curated by ChEMBL
LigandPNGBDBM50202690(2-(4-(2-(4-isopropoxyphenoxy)thiazol-5-yl)but-3-yn...)
Affinity DataIC50: >3.00E+4nM. Assay description: Inhibition of ACC2
In DepthDetails ArticlePubMed