BDBM50202761 CHEMBL239371::N-(4-(3-(4-o-tolylpiperazin-1-yl)propylthio)phenyl)acetamide
SMILES CC(=O)Nc1ccc(SCCCN2CCN(CC2)c2ccccc2C)cc1
InChI Key InChIKey=TVBFWBJCJFKKPL-UHFFFAOYSA-N
Data  1 KI
  Tab Delimited (TSV)   2D SDfile   Computed 3D by Vconf -m prep SDfile
Find this compound or compounds like it in BindingDB:
Activity Spreadsheet -- Enzyme Inhibition Constant Data from BindingDB
Found 1 hit for monomerid = 50202761
Target5-hydroxytryptamine receptor 2A(Rattus norvegicus (rat))
Central Drug Research Institute
Curated by ChEMBL
LigandPNGBDBM50202761(CHEMBL239371 | N-(4-(3-(4-o-tolylpiperazin-1-yl)pr...)
Affinity DataKi:  21.1nM. Assay description: Displacement of [3H]ketanserin from rat cloned 5HT2A receptor expressed in NIH-3T3-GF6 cells
In DepthDetails ArticlePubMed