BDBM50203193 CHEMBL3898358
SMILES O=S(=O)(Nc1ccc(Oc2ccccc2)cc1)c1ccccc1
InChI Key InChIKey=TYMJYOJIIUAOJI-UHFFFAOYSA-N
Data  1 IC50
  Tab Delimited (TSV)   2D SDfile   Computed 3D by Vconf -m prep SDfile
Find this compound or compounds like it in BindingDB:
Activity Spreadsheet -- Enzyme Inhibition Constant Data from BindingDB
Found 1 hit for monomerid = 50203193
TargetProgesterone receptor(Homo sapiens (Human))
Tokyo Medical And Dental University
Curated by ChEMBL
LigandPNGBDBM50203193(CHEMBL3898358)
Affinity DataIC50:  520nM. Assay description: Antagonist activity at progesterone receptor in human T47D cells incubated for 24 hrs in presence of P4 by alkaline phosphatase assay
In DepthDetails ArticlePubMed