BDBM50203207 3-(RS)-N-(4-(piperidin-1-ylmethyl)benzyl)-3-(naphthalene-7-sulfonamido)-3-phenylpropanamide::CHEMBL221691
SMILES O=C(CC(NS(=O)(=O)c1ccc2ccccc2c1)c1ccccc1)NCc1ccc(CN2CCCCC2)cc1
InChI Key InChIKey=LQXRODXTSWTMOG-UHFFFAOYSA-N
Data  2 KI  1 IC50
  Tab Delimited (TSV)   2D SDfile   Computed 3D by Vconf -m prep SDfile
Find this compound or compounds like it in BindingDB:
Activity Spreadsheet -- Enzyme Inhibition Constant Data from BindingDB
Found 3 hits for monomerid = 50203207
TargetB1 bradykinin receptor(Homo sapiens (Human))
Amgen
Curated by ChEMBL
LigandPNGBDBM50203207(3-(RS)-N-(4-(piperidin-1-ylmethyl)benzyl)-3-(napht...)
Affinity DataKi:  382nM. Assay description: Displacement of [3H]DAK from human bradykinin B1 receptor expressed in CHO-D cells
In DepthDetails ArticlePubMed
TargetB2 bradykinin receptor(Homo sapiens (Human))
Amgen
Curated by ChEMBL
LigandPNGBDBM50203207(3-(RS)-N-(4-(piperidin-1-ylmethyl)benzyl)-3-(napht...)
Affinity DataKi:  5.60E+4nM. Assay description: Displacement of [3H]bradykinin from human bradykinin B2 receptor expressed in CHO-K1 cells
In DepthDetails ArticlePubMed
TargetB1 bradykinin receptor(Homo sapiens (Human))
Amgen
Curated by ChEMBL
LigandPNGBDBM50203207(3-(RS)-N-(4-(piperidin-1-ylmethyl)benzyl)-3-(napht...)
Affinity DataIC50:  359nM. Assay description: Antagonistic activity at human bradykinin B1 receptor expressed in CHO cells assessed as effect on DAK-mediated calcium mobilization
In DepthDetails ArticlePubMed