BDBM50203340 CHEMBL3938615
SMILES FC(F)(F)S(=O)(=O)N1CCN(CC1)c1ccc(OC[C@@H]2CO[C@](Cn3ccnc3)(O2)c2ccc(Cl)cc2Cl)cc1
InChI Key InChIKey=IWCNTLJKALUKGD-ZJSXRUAMSA-N
Data  5 IC50
  Tab Delimited (TSV)   2D SDfile   Computed 3D by Vconf -m prep SDfile
Find this compound or compounds like it in BindingDB:
Activity Spreadsheet -- Enzyme Inhibition Constant Data from BindingDB
Found 5 hits for monomerid = 50203340
TargetAromatase(Homo sapiens (Human))
Temple University School Of Pharmacy
Curated by ChEMBL
LigandPNGBDBM50203340(CHEMBL3938615)
Affinity DataIC50:  790nM. Assay description: Inhibition of Cyp19 (unknown origin)
In DepthDetails ArticlePubMed
TargetCytochrome P450 3A4(Homo sapiens (Human))
Temple University School Of Pharmacy
Curated by ChEMBL
LigandPNGBDBM50203340(CHEMBL3938615)
Affinity DataIC50:  336nM. Assay description: Inhibition of human Cyp3A4 using testosterone as substrate by LC-MS/MS analysis
In DepthDetails ArticlePubMed
TargetCytochrome P450 11B1, mitochondrial(Homo sapiens (Human))
Temple University School Of Pharmacy
Curated by ChEMBL
LigandPNGBDBM50203340(CHEMBL3938615)
Affinity DataIC50:  32nM. Assay description: Inhibition of recombinant CYP11B1 (unknown origin) overexpressed in human AD293 cells assessed as reduction in cortisol formation preincubated for 60...
In DepthDetails ArticlePubMed
TargetSteroid 17-alpha-hydroxylase/17,20 lyase(Homo sapiens (Human))
Temple University School Of Pharmacy
Curated by ChEMBL
LigandPNGBDBM50203340(CHEMBL3938615)
Affinity DataIC50:  67nM. Assay description: Inhibition of recombinant CYP17 (unknown origin) overexpressed in human AD293 cells using [21-3H]17alpha-hydroxyl-pregenolone as substrate preincubat...
In DepthDetails ArticlePubMed
TargetSteroid 21-hydroxylase(Homo sapiens (Human))
Temple University School Of Pharmacy
Curated by ChEMBL
LigandPNGBDBM50203340(CHEMBL3938615)
Affinity DataIC50:  49nM. Assay description: Inhibition of recombinant CYP21 (unknown origin) overexpressed in human AD293 cells assessed as reduction in 11-deoxycortisol formation preincubated ...
In DepthDetails ArticlePubMed