BDBM50203486 2-(4-(4-(2-isopropoxyphenyl)piperazin-1-yl)cyclohexyl)-2H-pyrrolo[3,4-c]pyridine-1,3-dione::CHEMBL243229
SMILES CC(C)Oc1ccccc1N1CCN(CC1)C1CCC(CC1)N1C(=O)c2ccncc2C1=O
InChI Key InChIKey=TVYZZMXYQYLCHO-UHFFFAOYSA-N
Data  3 KI
  Tab Delimited (TSV)   2D SDfile   Computed 3D by Vconf -m prep SDfile
Find this compound or compounds like it in BindingDB:
Activity Spreadsheet -- Enzyme Inhibition Constant Data from BindingDB
Found 3 hits for monomerid = 50203486
TargetAlpha-1A adrenergic receptor(Homo sapiens (Human))
Johnson & Johnson Pharmaceutical Research And Development
Curated by ChEMBL
LigandPNGBDBM50203486(2-(4-(4-(2-isopropoxyphenyl)piperazin-1-yl)cyclohe...)
Affinity DataKi:  0.400nM. Assay description: Displacement of [125]HEAT from human adrenergic alpha1a receptor expressed in CHO cells
In DepthDetails ArticlePubMed
TargetAlpha-1D adrenergic receptor(Homo sapiens (Human))
Johnson & Johnson Pharmaceutical Research And Development
Curated by ChEMBL
LigandPNGBDBM50203486(2-(4-(4-(2-isopropoxyphenyl)piperazin-1-yl)cyclohe...)
Affinity DataKi:  0.800nM. Assay description: Displacement of [125]HEAT from human adrenergic alpha1d receptor expressed in CHO cells
In DepthDetails ArticlePubMed
TargetAlpha-1B adrenergic receptor(Homo sapiens (Human))
Johnson & Johnson Pharmaceutical Research And Development
Curated by ChEMBL
LigandPNGBDBM50203486(2-(4-(4-(2-isopropoxyphenyl)piperazin-1-yl)cyclohe...)
Affinity DataKi:  22.4nM. Assay description: Displacement of [125]HEAT from human adrenergic alpha1b receptor expressed in CHO cells
In DepthDetails ArticlePubMed