BDBM50203488 CHEMBL3957141
SMILES OC(=O)c1ccc(cc1)-n1nc(Cc2c(Cl)cccc2Cl)c2ccccc12
InChI Key InChIKey=BECKJCJWYWWZGT-UHFFFAOYSA-N
Data  2 IC50
  Tab Delimited (TSV)   2D SDfile   Computed 3D by Vconf -m prep SDfile
Find this compound or compounds like it in BindingDB:
Activity Spreadsheet -- Enzyme Inhibition Constant Data from BindingDB
Found 2 hits for monomerid = 50203488
TargetNuclear receptor ROR-gamma(Homo sapiens (Human))
Galderma R & D
Curated by ChEMBL
LigandPNGBDBM50203488(CHEMBL3957141)
Affinity DataIC50:  1.80E+3nM. Assay description: Inverse agonist activity at GAL4 DBD-fused RORgammat LBD (unknown origin) expressed in HG5LN cells after 18 hrs by luciferase reporter gene assay
In DepthDetails ArticlePubMed
TargetRetinoic acid receptor gamma(Homo sapiens (Human))
Galderma R & D
Curated by ChEMBL
LigandPNGBDBM50203488(CHEMBL3957141)
Affinity DataIC50:  6.80E+3nM. Assay description: Inverse agonist activity at GAL4 DBD-fused RARgamma LBD (unknown origin) expressed in human HG5LN cells after 18 hrs by luciferase reporter gene assa...
In DepthDetails ArticlePubMed