BDBM50203675 CHEMBL3961009
SMILES Cc1cc(OCCCC(O)=O)ccc1-c1cc(OC(F)(F)F)ccc1Cl
InChI Key InChIKey=IXCGAOKQTBZAKH-UHFFFAOYSA-N
Data  3 EC50
  Tab Delimited (TSV)   2D SDfile   Computed 3D by Vconf -m prep SDfile
Find this compound or compounds like it in BindingDB:
Activity Spreadsheet -- Enzyme Inhibition Constant Data from BindingDB
Found 3 hits for monomerid = 50203675
TargetFree fatty acid receptor 4(Mus musculus)
Merck
Curated by ChEMBL
LigandPNGBDBM50203675(CHEMBL3961009)
Affinity DataEC50:  78nM. Assay description: Agonist activity at mouse GPR120 expressed in CHOK1 cells measured after 60 mins by IP1-HTRF assay
In DepthDetails ArticlePubMed
TargetFree fatty acid receptor 1(Homo sapiens (Human))
Merck
Curated by ChEMBL
LigandPNGBDBM50203675(CHEMBL3961009)
Affinity DataEC50: >9.95E+3nM. Assay description: Agonist activity at human GPR40 measured after 60 mins by IP1-HTRF assay
In DepthDetails ArticlePubMed
TargetFree fatty acid receptor 4(Homo sapiens (Human))
Merck
Curated by ChEMBL
LigandPNGBDBM50203675(CHEMBL3961009)
Affinity DataEC50:  254nM. Assay description: Agonist activity at human GPR120 expressed in CHOK1 cells measured after 60 mins by IP1-HTRF assay
In DepthDetails ArticlePubMed