BDBM50203763 CHEMBL3963945
SMILES FC1(F)CCN(CC1Oc1ccccn1)C(=O)c1ccccc1-n1nccn1
InChI Key InChIKey=MCRVAAHURKFSNP-UHFFFAOYSA-N
Data  1 KI
  Tab Delimited (TSV)   2D SDfile   Computed 3D by Vconf -m prep SDfile
Find this compound or compounds like it in BindingDB:
Activity Spreadsheet -- Enzyme Inhibition Constant Data from BindingDB
Found 1 hit for monomerid = 50203763
TargetOrexin receptor type 2(Homo sapiens (Human))
Merck Research Laboratories
Curated by ChEMBL
LigandPNGBDBM50203763(CHEMBL3963945)
Affinity DataKi:  1.04E+3nM. Assay description: Displacement of (2S)-N-(2-pyrrol-1-ylphenyl)-1-[2-[1-(tritritiomethyl)benzimidazol-2-yl]sulfanylacetyl]pyrrolidine-2-carboxamide from human OX2 recep...
In DepthDetails ArticlePubMed