BDBM50204070 CHEMBL3984247
SMILES O=C(NN1CCSCC1)c1cccc(c1)S(=O)(=O)N1CCc2ccccc2C1
InChI Key InChIKey=UWTMOFZHDCRQND-UHFFFAOYSA-N
Data  2 IC50
  Tab Delimited (TSV)   2D SDfile   Computed 3D by Vconf -m prep SDfile
Find this compound or compounds like it in BindingDB:
Activity Spreadsheet -- Enzyme Inhibition Constant Data from BindingDB
Found 2 hits for monomerid = 50204070
TargetAldo-keto reductase family 1 member C3(Homo sapiens (Human))
Guangzhou Medical University
Curated by ChEMBL
LigandPNGBDBM50204070(CHEMBL3984247)
Affinity DataIC50:  447nM. Assay description: Inhibition of human recombinant His-tagged AKR1C3 expressed in Escherichia coli BL21 (DE3) cells using 8-Acetyl-2,3,5,6-tetrahydro-1H,4H-11-oxa-3a-az...
In DepthDetails ArticlePubMed
TargetAldo-keto reductase family 1 member C3(Homo sapiens (Human))
Guangzhou Medical University
Curated by ChEMBL
LigandPNGBDBM50204070(CHEMBL3984247)
Affinity DataIC50:  450nM. Assay description: Inhibition of human recombinant His-tagged AKR1C3 expressed in Escherichia coli BL21 (DE3) cells using 8-Acetyl-2,3,5,6-tetrahydro-1H,4H-11-oxa-3a-az...
In DepthDetails ArticlePubMed