BDBM50204146 1-amino-2-phenylethyl(1-hydroxy-3-phenylpropyl)phosphinic acid::CHEMBL226864::alpha1-(1-amino-1-phenylmethane)-alpha2-(1-hydroxy-3-phenylpropane) phosphinicacid
SMILES NC(Cc1ccccc1)P(O)(O)C(=O)CCc1ccccc1
InChI Key InChIKey=CLJNISIKXYCUDX-UHFFFAOYSA-N
Data  1 IC50
  Tab Delimited (TSV)   2D SDfile   Computed 3D by Vconf -m prep SDfile
Find this compound or compounds like it in BindingDB:
Activity Spreadsheet -- Enzyme Inhibition Constant Data from BindingDB
Found 1 hit for monomerid = 50204146
TargetAminopeptidase N(Homo sapiens (Human))
Wroclaw University Of Technology
Curated by ChEMBL
LigandPNGBDBM50204146(1-amino-2-phenylethyl(1-hydroxy-3-phenylpropyl)pho...)
Affinity DataIC50:  240nM. Assay description: Inhibition of APN
In DepthDetails ArticlePubMed