BDBM50204476 1-(5-(2-methoxyphenyl)oxazol-2-yl)-7-phenylheptan-1-one::CHEMBL223694
SMILES COc1ccccc1-c1cnc(o1)C(=O)CCCCCCc1ccccc1
InChI Key InChIKey=OJSBYACDUHKDQN-UHFFFAOYSA-N
Data  2 KI
  Tab Delimited (TSV)   2D SDfile   Computed 3D by Vconf -m prep SDfile
Find this compound or compounds like it in BindingDB:
Activity Spreadsheet -- Enzyme Inhibition Constant Data from BindingDB
Found 2 hits for monomerid = 50204476
TargetFatty-acid amide hydrolase 1(Homo sapiens (Human))
The Scripps Research Institute
Curated by ChEMBL
LigandPNGBDBM50204476(1-(5-(2-methoxyphenyl)oxazol-2-yl)-7-phenylheptan-...)
Affinity DataKi:  400nM. Assay description: Inhibition of rat recombinant FAAH expressed in Escherichia coli by [14C]oleamide breakdown
In DepthDetails ArticlePubMed
TargetFatty-acid amide hydrolase 1(Homo sapiens (Human))
The Scripps Research Institute
Curated by ChEMBL
LigandPNGBDBM50204476(1-(5-(2-methoxyphenyl)oxazol-2-yl)-7-phenylheptan-...)
Affinity DataKi:  400nM. Assay description: Inhibition of FAAH
In DepthDetails ArticlePubMed