BDBM50204484 CHEMBL3908512
SMILES OCc1ccc(s1)-c1nc(-c2ccccc2CO)c2ccccn12
InChI Key InChIKey=RUSRKTMSFAJPJW-UHFFFAOYSA-N
Data  1 IC50
  Tab Delimited (TSV)   2D SDfile   Computed 3D by Vconf -m prep SDfile
Find this compound or compounds like it in BindingDB:
Activity Spreadsheet -- Enzyme Inhibition Constant Data from BindingDB
Found 1 hit for monomerid = 50204484
TargetEndothelial PAS domain-containing protein 1/Hypoxia-inducible factor 1-alpha(Homo sapiens (Human))
Tokyo Institute Of Innovative Research
Curated by ChEMBL
LigandPNGBDBM50204484(CHEMBL3908512)
Affinity DataIC50:  9.40E+3nM. Assay description: Inhibition of hypoxia-induced HIF1 transcriptional activity in human HeLa cells measured after 12 hrs by luciferase reporter gene assay
In DepthDetails ArticlePubMed