BDBM50204498 CHEMBL3902620
SMILES CCN(C)C(=O)Oc1ccc(cc1)C(=O)\C=C\c1ccc(OC)cc1
InChI Key InChIKey=OMBSZDNOEIPQLC-VGOFMYFVSA-N
Data  1 IC50
  Tab Delimited (TSV)   2D SDfile   Computed 3D by Vconf -m prep SDfile
Find this compound or compounds like it in BindingDB:
Activity Spreadsheet -- Enzyme Inhibition Constant Data from BindingDB
Found 1 hit for monomerid = 50204498
TargetCholinesterase(Homo sapiens (Human))
South China University Of Technology
Curated by ChEMBL
LigandPNGBDBM50204498(CHEMBL3902620)
Affinity DataIC50:  7.36E+3nM. Assay description: Inhibition of human serum BChE using S-Butyrylthiocholine iodide as substrate preincubated for 15 mins followed by substrate addition by Ellman's met...
In DepthDetails ArticlePubMed