BDBM50204854 CHEMBL3929352
SMILES CCCc1n[nH]c2Oc3nc4CCCCCc4c(N)c3C(c12)c1ccccc1
InChI Key InChIKey=LAPLNXMWKVWQHW-UHFFFAOYSA-N
Data  2 IC50
  Tab Delimited (TSV)   2D SDfile   Computed 3D by Vconf -m prep SDfile
Find this compound or compounds like it in BindingDB:
Activity Spreadsheet -- Enzyme Inhibition Constant Data from BindingDB
Found 2 hits for monomerid = 50204854
TargetCholinesterase(Homo sapiens (Human))
Tehran University Of Medical Sciences
Curated by ChEMBL
LigandPNGBDBM50204854(CHEMBL3929352)
Affinity DataIC50:  43nM. Assay description: Inhibition of human recombinant BChE using butyrylthiocholine iodide as substrate incubated for 5 mins followed by substrate addition measured for 1 ...
In DepthDetails ArticlePubMed
TargetAcetylcholinesterase(Electrophorus electricus (Electric eel))
Tehran University Of Medical Sciences
Curated by ChEMBL
LigandPNGBDBM50204854(CHEMBL3929352)
Affinity DataIC50:  650nM. Assay description: Inhibition of electric eel AChE using acetylthiocholine iodide as substrate incubated for 5 mins followed by substrate addition measured for 1 min by...
In DepthDetails ArticlePubMed