BDBM50204899 (4-benzylpiperidine-1-yl)-[5(6)-hydroxy-1H-benzimidazol-2-yl]-methanone::CHEMBL223248
SMILES Oc1cc2nc([nH]c2cc1O)C(=O)N1CCC(Cc2ccccc2)CC1
InChI Key InChIKey=YYENVTJJGKTXJN-UHFFFAOYSA-N
Data  2 IC50
  Tab Delimited (TSV)   2D SDfile   Computed 3D by Vconf -m prep SDfile
Find this compound or compounds like it in BindingDB:
Activity Spreadsheet -- Enzyme Inhibition Constant Data from BindingDB
Found 2 hits for monomerid = 50204899
TargetGlutamate receptor ionotropic, NMDA 2B(Rattus norvegicus (Rat))
Gedeon Richter
Curated by ChEMBL
LigandPNGBDBM50204899((4-benzylpiperidine-1-yl)-[5(6)-hydroxy-1H-benzimi...)
Affinity DataIC50:  4nM. Assay description: Displacement of [3H]Ro 25,6981 from NR2B NMDA receptor in rat forebrain
In DepthDetails ArticlePubMed
TargetGlutamate receptor ionotropic, NMDA 2B(Rattus norvegicus (Rat))
Gedeon Richter
Curated by ChEMBL
LigandPNGBDBM50204899((4-benzylpiperidine-1-yl)-[5(6)-hydroxy-1H-benzimi...)
Affinity DataIC50:  2.20nM. Assay description: Antagonist activity at NR2B NMDA receptor in Wistar rat neocortical cells assessed as inhibition of NMDA-evoked elevation of intracellular calcium co...
In DepthDetails ArticlePubMed