BDBM50205195 CHEMBL3898853
SMILES CC(=O)N1CCN(CC1)C(=O)CC1(CC1)[C@H]1COC[C@@H](C2CC2)N1S(=O)(=O)c1ccc(F)cc1
InChI Key InChIKey=PSIXVFRBHYZYAL-FCHUYYIVSA-N
Data  2 IC50
  Tab Delimited (TSV)   2D SDfile   Computed 3D by Vconf -m prep SDfile
Find this compound or compounds like it in BindingDB:
Activity Spreadsheet -- Enzyme Inhibition Constant Data from BindingDB
Found 2 hits for monomerid = 50205195
TargetCytochrome P450 3A4(Homo sapiens (Human))
Merck Research Laboratories
Curated by ChEMBL
LigandPNGBDBM50205195(CHEMBL3898853)
Affinity DataIC50:  3.00E+4nM. Assay description: Inhibition of recombinant human CYP3A4 expressed in baculovirus infected insect cells using fluorescent substrate
In DepthDetails ArticlePubMed
TargetCytochrome P450 3A4(Homo sapiens (Human))
Merck Research Laboratories
Curated by ChEMBL
LigandPNGBDBM50205195(CHEMBL3898853)
Affinity DataIC50:  1.70E+4nM. Assay description: Inhibition of recombinant human CYP3A4 expressed in baculovirus infected insect cells preincubated for 30 mins using fluorescent substrate
In DepthDetails ArticlePubMed