BDBM50205295 CHEMBL263090::d[Cha4,Orn8]VP
SMILES NCCC[C@H](NC(=O)[C@@H]1CCCN1C(=O)[C@@H]1CSSCCC(=O)N[C@@H](Cc2ccc(O)cc2)C(=O)N[C@@H](Cc2ccccc2)C(=O)N[C@@H](CC2CCCCC2)C(=O)N[C@@H](CC(N)=O)C(=O)N1)C(=O)NCC(N)=O
InChI Key InChIKey=CADGMGWLZUBCQD-ZTYVOHGWSA-N
Data  4 KI  1 Kd
  Tab Delimited (TSV)   2D SDfile   Computed 3D by Vconf -m prep SDfile
Find this compound or compounds like it in BindingDB:
Activity Spreadsheet -- Enzyme Inhibition Constant Data from BindingDB
Found 5 hits for monomerid = 50205295
TargetVasopressin V1b receptor(RAT)
University Of Montpellier
Curated by ChEMBL
LigandPNGBDBM50205295(CHEMBL263090 | d[Cha4,Orn8]VP)
Affinity DataKi:  3nM. Assay description: Displacement of [3H]AVP from rat vasopressin V1b receptor expressed in At-T20 cells
In DepthDetails ArticlePubMed
TargetVasopressin V2 receptor(Rattus norvegicus (Rat))
University Of Montpellier
Curated by ChEMBL
LigandPNGBDBM50205295(CHEMBL263090 | d[Cha4,Orn8]VP)
Affinity DataKi:  450nM. Assay description: Displacement of [3H]AVP from vasopressin V2 receptor in rat kidney membranes
In DepthDetails ArticlePubMed
TargetOxytocin receptor(RAT)
University Of Montpellier
Curated by ChEMBL
LigandPNGBDBM50205295(CHEMBL263090 | d[Cha4,Orn8]VP)
Affinity DataKi:  550nM. Assay description: Displacement of [3H]AVP from rat OT receptor expressed in CHO cells
In DepthDetails ArticlePubMed
TargetVasopressin V1a receptor(RAT)
University Of Montpellier
Curated by ChEMBL
LigandPNGBDBM50205295(CHEMBL263090 | d[Cha4,Orn8]VP)
Affinity DataKi:  2.90E+3nM. Assay description: Displacement of [3H]AVP from vasopressin V1a receptor in rat liver membrane
In DepthDetails ArticlePubMed
TargetOxytocin receptor(Homo sapiens (Human))
University Of Montpellier
Curated by ChEMBL
LigandPNGBDBM50205295(CHEMBL263090 | d[Cha4,Orn8]VP)
Affinity DataKd:  282nM. Assay description: Activity at OT receptor assessed as oxytocic activity in absence of magnesium
In DepthDetails ArticlePubMed