BDBM50205306 CHEMBL375323::d[Orn4,Lys8]VP
SMILES NCCCC[C@H](NC(=O)[C@@H]1CCCN1C(=O)[C@@H]1CSSCCC(=O)N[C@@H](Cc2ccc(O)cc2)C(=O)N[C@@H](Cc2ccccc2)C(=O)N[C@@H](CCCN)C(=O)N[C@@H](CC(N)=O)C(=O)N1)C(=O)NCC(N)=O
InChI Key InChIKey=MYTIGVSAVZNLKG-QJCLFNHPSA-N
Data  4 KI
  Tab Delimited (TSV)   2D SDfile   Computed 3D by Vconf -m prep SDfile
Find this compound or compounds like it in BindingDB:
Activity Spreadsheet -- Enzyme Inhibition Constant Data from BindingDB
Found 4 hits for monomerid = 50205306
TargetVasopressin V1b receptor(RAT)
University Of Montpellier
Curated by ChEMBL
LigandPNGBDBM50205306(CHEMBL375323 | d[Orn4,Lys8]VP)
Affinity DataKi:  0.450nM. Assay description: Displacement of [3H]AVP from rat vasopressin V1b receptor expressed in At-T20 cells
In DepthDetails ArticlePubMed
TargetOxytocin receptor(RAT)
University Of Montpellier
Curated by ChEMBL
LigandPNGBDBM50205306(CHEMBL375323 | d[Orn4,Lys8]VP)
Affinity DataKi:  22nM. Assay description: Displacement of [3H]AVP from rat OT receptor expressed in CHO cells
In DepthDetails ArticlePubMed
TargetVasopressin V2 receptor(Rattus norvegicus (Rat))
University Of Montpellier
Curated by ChEMBL
LigandPNGBDBM50205306(CHEMBL375323 | d[Orn4,Lys8]VP)
Affinity DataKi:  51nM. Assay description: Displacement of [3H]AVP from vasopressin V2 receptor in rat kidney membranes
In DepthDetails ArticlePubMed
TargetVasopressin V1a receptor(RAT)
University Of Montpellier
Curated by ChEMBL
LigandPNGBDBM50205306(CHEMBL375323 | d[Orn4,Lys8]VP)
Affinity DataKi:  2.80E+3nM. Assay description: Displacement of [3H]AVP from vasopressin V1a receptor in rat liver membrane
In DepthDetails ArticlePubMed