BDBM50205385 CHEMBL220255::{3-[2-(3,4,5-trihydroxy-phenyl)-acetylamino]-phenyl}-acetic acid
SMILES OC(=O)Cc1cccc(NC(=O)Cc2cc(O)c(O)c(O)c2)c1
InChI Key InChIKey=MGQZCYRVONIJQR-UHFFFAOYSA-N
Data  3 IC50
  Tab Delimited (TSV)   2D SDfile   Computed 3D by Vconf -m prep SDfile
Find this compound or compounds like it in BindingDB:
Activity Spreadsheet -- Enzyme Inhibition Constant Data from BindingDB
Found 3 hits for monomerid = 50205385
TargetE-selectin(Homo sapiens (Human))
Revotar Biopharmaceuticals
Curated by ChEMBL
LigandPNGBDBM50205385(CHEMBL220255 | {3-[2-(3,4,5-trihydroxy-phenyl)-ace...)
Affinity DataIC50:  1.00E+3nM. Assay description: Inhibition of human E-selectin after 2 hrs
In DepthDetails ArticlePubMed
TargetP-selectin(Homo sapiens (Human))
Revotar Biopharmaceuticals
Curated by ChEMBL
LigandPNGBDBM50205385(CHEMBL220255 | {3-[2-(3,4,5-trihydroxy-phenyl)-ace...)
Affinity DataIC50:  2.10E+3nM. Assay description: Inhibition of human P-selectin after 2 hrs
In DepthDetails ArticlePubMed
TargetL-selectin(Homo sapiens (Human))
Revotar Biopharmaceuticals
Curated by ChEMBL
LigandPNGBDBM50205385(CHEMBL220255 | {3-[2-(3,4,5-trihydroxy-phenyl)-ace...)
Affinity DataIC50: >5.00E+5nM. Assay description: Inhibition of human L-selectin after 2 hrs
In DepthDetails ArticlePubMed