BDBM50205809 CHEMBL374535::N-methyl-N-(2-(naphthalen-2-ylmethoxy)-4-nitrophenyl)methanesulfonamide::N-methyl-N-[2-(beta-naphthylmethoxy) 4-nitrophenyl]methanesulfonamide
SMILES CN(c1ccc(cc1OCc1ccc2ccccc2c1)[N+]([O-])=O)S(C)(=O)=O
InChI Key InChIKey=BJRZSLQVXYWGEY-UHFFFAOYSA-N
Data  2 IC50
  Tab Delimited (TSV)   2D SDfile   Computed 3D by Vconf -m prep SDfile
Find this compound or compounds like it in BindingDB:
Activity Spreadsheet -- Enzyme Inhibition Constant Data from BindingDB
Found 2 hits for monomerid = 50205809
TargetAromatase(Homo sapiens (Human))
The Ohio State University
Curated by ChEMBL
LigandPNGBDBM50205809(CHEMBL374535 | N-methyl-N-(2-(naphthalen-2-ylmetho...)
Affinity DataIC50:  2.68E+3nM. Assay description: Inhibition of aromatase in human SKBR3 cells by tritiated water release assay
In DepthDetails ArticlePubMed
TargetAromatase(Homo sapiens (Human))
The Ohio State University
Curated by ChEMBL
LigandPNGBDBM50205809(CHEMBL374535 | N-methyl-N-(2-(naphthalen-2-ylmetho...)
Affinity DataIC50:  2.68E+3nM. Assay description: Inhibition of aromatase in SK-BR-3 cells by tritiated water release assay
In DepthDetails ArticlePubMed