BDBM50206126 3-(6-(1H-imidazol-1-yl)-4-methyl-1H-benzo[d]imidazol-2-yl)-4-((S)-3-(3-chlorophenyl)-1-hydroxypropan-2-ylamino)pyridin-2(1H)-one::CHEMBL245366
SMILES Cc1cc(cc2nc([nH]c12)-c1c(N[C@H](CO)Cc2cccc(Cl)c2)cc[nH]c1=O)-n1ccnc1
InChI Key InChIKey=QZBMIUISTXROQE-SFHVURJKSA-N
Data  1 IC50
  Tab Delimited (TSV)   2D SDfile   Computed 3D by Vconf -m prep SDfile
Find this compound or compounds like it in BindingDB:
Activity Spreadsheet -- Enzyme Inhibition Constant Data from BindingDB
Found 1 hit for monomerid = 50206126
TargetInsulin-like growth factor 1 receptor(Homo sapiens (Human))
Bristol-Myers Squibb Pharmaceutical Research Institute
Curated by ChEMBL
LigandPNGBDBM50206126(3-(6-(1H-imidazol-1-yl)-4-methyl-1H-benzo[d]imidaz...)
Affinity DataIC50:  730nM. Assay description: Inhibition of human recombinant IGF1 receptor
In DepthDetails ArticlePubMed