BDBM50206240 CHEMBL3928422
SMILES C1N=C(Nc2ncnc3ccsc23)O[C@]11CN2CCC1CC2
InChI Key InChIKey=WQURRNDPPVYVAR-HNNXBMFYSA-N
Data  1 IC50  1 EC50
  Tab Delimited (TSV)   2D SDfile   Computed 3D by Vconf -m prep SDfile
Find this compound or compounds like it in BindingDB:
Activity Spreadsheet -- Enzyme Inhibition Constant Data from BindingDB
Found 2 hits for monomerid = 50206240
Target5-hydroxytryptamine receptor 3A(Homo sapiens (Human))
Bristol-Myers Squibb Research And Development
Curated by ChEMBL
LigandPNGBDBM50206240(CHEMBL3928422)
Affinity DataIC50:  50nM. Assay description: Antagonist activity at 5-HT3A receptor (unknown origin) expressed in HEK293 cells assessed as inhibition of Ca2+ flux by Fluo-4-AM dye based FLIPR as...
In DepthDetails ArticlePubMed
TargetNeuronal acetylcholine receptor subunit alpha-7(Homo sapiens (Human))
Bristol-Myers Squibb Research And Development
Curated by ChEMBL
LigandPNGBDBM50206240(CHEMBL3928422)
Affinity DataEC50:  40nM. Assay description: Agonist activity at alpha7 nACh receptor (unknown origin) expressed in HEK293 cells assessed as increase in Ca2+ flux by Fluo-4-AM dye based FLIPR as...
In DepthDetails ArticlePubMed