BDBM50206280 4-(4-(2-aminopropan-2-yl)phenyl)-5-chloro-N-(4-(2-morpholinoethyl)phenyl)pyrimidin-2-amine::4-ARYL-2-PHENYLAMINO PYRIMIDINE::CHEMBL233209
SMILES CC(C)(N)c1ccc(cc1)-c1nc(Nc2ccc(CCN3CCOCC3)cc2)ncc1Cl
InChI Key InChIKey=CJSSYVIHFXDFFC-UHFFFAOYSA-N
Data  2 IC50
PDB links: 1 PDB ID matches this monomer.
  Tab Delimited (TSV)   2D SDfile   Computed 3D by Vconf -m prep SDfile
Find this compound or compounds like it in BindingDB:
Activity Spreadsheet -- Enzyme Inhibition Constant Data from BindingDB
Found 2 hits for monomerid = 50206280
TargetCyclin-dependent kinase 1(Homo sapiens (Human))
Johnson & Johnson Pharmaceutical Research & Development
Curated by ChEMBL
LigandPNGBDBM50206280(4-(4-(2-aminopropan-2-yl)phenyl)-5-chloro-N-(4-(2-...)
Affinity DataIC50:  2.77E+3nM. Assay description: Inhibition of CDK1
In DepthDetails ArticlePubMed
TargetVascular endothelial growth factor receptor 2(Homo sapiens (Human))
Johnson & Johnson Pharmaceutical Research & Development
Curated by ChEMBL
LigandPNGBDBM50206280(4-(4-(2-aminopropan-2-yl)phenyl)-5-chloro-N-(4-(2-...)
Affinity DataIC50:  148nM. Assay description: Inhibiton of VEGFR2
In DepthDetails ArticlePubMed