BDBM50206393 CHEMBL3954695
SMILES OC(=O)\C=C/C(=O)Nc1cccc(c1)-c1n[nH]c2ccc(NS(=O)(=O)c3ccc(cc3)[N+]([O-])=O)cc12
InChI Key InChIKey=MGHRIOSQJVOCSQ-KHPPLWFESA-N
Data  2 IC50
  Tab Delimited (TSV)   2D SDfile   Computed 3D by Vconf -m prep SDfile
Find this compound or compounds like it in BindingDB:
Activity Spreadsheet -- Enzyme Inhibition Constant Data from BindingDB
Found 2 hits for monomerid = 50206393
TargetAurora kinase A(Homo sapiens (Human))
Taiwan National Health Research Institutes
Curated by ChEMBL
LigandPNGBDBM50206393(CHEMBL3954695)
Affinity DataIC50:  480nM. Assay description: Inhibition of GST-tagged Aurora A (123 to 401 residues) (unknown origin) preincubated for 15 mins followed by tetra(LRRWSLG) substrate addition measu...
In DepthDetails ArticlePubMed
TargetAurora kinase B(Homo sapiens (Human))
Taiwan National Health Research Institutes
Curated by ChEMBL
LigandPNGBDBM50206393(CHEMBL3954695)
Affinity DataIC50:  26nM. Assay description: Inhibition of human recombinant full-length His-tagged Aurora B expressed in baculovirus expression system
In DepthDetails ArticlePubMed