BDBM50206447 CHEMBL3946537
SMILES CC(C)(C)c1ccc(cc1)S(=O)(=O)Nc1ccc2[nH]nc(-c3cccc(NC(=O)\C=C/C(O)=O)c3)c2c1
InChI Key InChIKey=PYEYDCUPUDQXIA-YPKPFQOOSA-N
Data  1 IC50
  Tab Delimited (TSV)   2D SDfile   Computed 3D by Vconf -m prep SDfile
Find this compound or compounds like it in BindingDB:
Activity Spreadsheet -- Enzyme Inhibition Constant Data from BindingDB
Found 1 hit for monomerid = 50206447
TargetAurora kinase A(Homo sapiens (Human))
Taiwan National Health Research Institutes
Curated by ChEMBL
LigandPNGBDBM50206447(CHEMBL3946537)
Affinity DataIC50: >1.00E+3nM. Assay description: Inhibition of GST-tagged Aurora A (123 to 401 residues) (unknown origin) preincubated for 15 mins followed by tetra(LRRWSLG) substrate addition measu...
In DepthDetails ArticlePubMed