BDBM50206466 CHEMBL3986107
SMILES Clc1cccc(\C=C2/S\C(=N/c3ccccc3)N(Cc3ccco3)C2=O)c1
InChI Key InChIKey=GYONDRBBSNEUSG-QFGKFHJGSA-N
Data  1 KI
  Tab Delimited (TSV)   2D SDfile   Computed 3D by Vconf -m prep SDfile
Find this compound or compounds like it in BindingDB:
Activity Spreadsheet -- Enzyme Inhibition Constant Data from BindingDB
Found 1 hit for monomerid = 50206466
TargetThioredoxin reductase(Entamoeba histolytica)
Jamia Millia Islamia
Curated by ChEMBL
LigandPNGBDBM50206466(CHEMBL3986107)
Affinity DataKi:  3.16E+3nM. Assay description: Inhibition of Entamoeba histolytica thioredoxin reductase
In DepthDetails ArticlePubMed